Reaction Details
TargetGlutathione S-transferase A1
LigandBDBM50186224
Substrate/Competitorn/a
Meas. Tech.ChEMBL_366182 (CHEMBL853397)
IC50 98.9±n/a nM
Citation Maeda, DYMahajan, SSAtkins, WMZebala, JA Bivalent inhibitors of glutathione S-transferase: the effect of spacer length on isozyme selectivity. Bioorg Med Chem Lett16:3780-3 (2006) 
 
Glutathione S-transferase A1
Name:Glutathione S-transferase A1
Type:Enzyme
Mol. Mass.:25636.31
Organism:Homo sapiens (Human)
Description:Glutathione-S-Transferase (GST, N-terminally)
Residue:222
BDBM50186224
NameBDBM50186224
Synonyms:3-({4-[4-(4-{2-[4-(but-1-en-2-yl)-2,3-dichlorophenoxy]acetamido}butanamido)butanamido]butanamido}methyl)-5-({4-[4-(4-{2-[2,3-dichloro-4-(2-methylidenebutanoyl)phenoxy]acetamido}butanamido)butanamido]butanamido}methyl)benzamide | CHEMBL216505
TypeSmall organic molecule
Emp. Form.C58H75Cl4N9O12
Mol. Mass.1232.081
SMILESCCC(=C)C(=O)c1ccc(OCC(=O)NCCCC(=O)NCCCC(=O)NCCCC(=O)NCc2cc(CNC(=O)CCCNC(=O)CCCNC(=O)CCCNC(=O)COc3ccc(C(=C)CC)c(Cl)c3Cl)cc(c2)C(N)=O)c(Cl)c1Cl