Reaction Details
TargetHistamine H3 receptor
LigandBDBM50186281
Substrate/Competitorn/a
Meas. Tech.ChEMBL_370710 (CHEMBL867233)
Ki 2.1±n/a nM
Citation Jesudason, CDBeavers, LSCramer, JWDill, JFinley, DRLindsley, CWStevens, FCGadski, RAOldham, SWPickard, RTSiedem, CSSindelar, DKSingh, AWatson, BMHipskind, PA Synthesis and SAR of novel histamine H3 receptor antagonists. Bioorg Med Chem Lett16:3415-8 (2006) 
 
Histamine H3 receptor
Name:Histamine H3 receptor
Type:G Protein-Coupled Receptor (GPCR)
Mol. Mass.:48691.47
Organism:Homo sapiens (Human)
Description:Binding assays were using CHO cells stably expressing hH3R receptors.
Residue:445
BDBM50186281
NameBDBM50186281
Synonyms:(6-(3-(piperidin-1-yl)propoxy)-3,4-dihydroisoquinolin-2(1H)-yl)(thiophen-2-yl)methanone | CHEMBL377099
TypeSmall organic molecule
Emp. Form.C22H28N2O2S
Mol. Mass.384.535
SMILESO=C(N1CCc2cc(OCCCN3CCCCC3)ccc2C1)c1cccs1