Reaction Details
TargetHistamine H3 receptor
LigandBDBM50186291
Substrate/Competitorn/a
Meas. Tech.ChEMBL_370711 (CHEMBL867234)
Ki 0.89±n/a nM
Citation Jesudason, CDBeavers, LSCramer, JWDill, JFinley, DRLindsley, CWStevens, FCGadski, RAOldham, SWPickard, RTSiedem, CSSindelar, DKSingh, AWatson, BMHipskind, PA Synthesis and SAR of novel histamine H3 receptor antagonists. Bioorg Med Chem Lett16:3415-8 (2006) 
 
Histamine H3 receptor
Name:Histamine H3 receptor
Type:G Protein-Coupled Receptor (GPCR)
Mol. Mass.:48607.98
Organism:Rattus norvegicus (rat)
Description:n/a
Residue:445
BDBM50186291
NameBDBM50186291
Synonyms:2-isopropyl-7-(3-(piperidin-1-yl)propoxy)-1,2,3,4-tetrahydroisoquinoline | CHEMBL208650
TypeSmall organic molecule
Emp. Form.C20H32N2O
Mol. Mass.316.4809
SMILESCC(C)N1CCc2ccc(OCCCN3CCCCC3)cc2C1