Reaction Details
TargetHistamine H3 receptor
LigandBDBM50186306
Substrate/Competitorn/a
Meas. Tech.ChEMBL_370711 (CHEMBL867234)
Ki 0.97±n/a nM
Citation Jesudason, CDBeavers, LSCramer, JWDill, JFinley, DRLindsley, CWStevens, FCGadski, RAOldham, SWPickard, RTSiedem, CSSindelar, DKSingh, AWatson, BMHipskind, PA Synthesis and SAR of novel histamine H3 receptor antagonists. Bioorg Med Chem Lett16:3415-8 (2006) 
 
Histamine H3 receptor
Name:Histamine H3 receptor
Type:G Protein-Coupled Receptor (GPCR)
Mol. Mass.:48607.98
Organism:Rattus norvegicus (rat)
Description:n/a
Residue:445
BDBM50186306
NameBDBM50186306
Synonyms:3-(cyclohexylmethyl)-7-(3-(piperidin-1-yl)propoxy)-2,3,4,5-tetrahydro-1H-benzo[d]azepine | CHEMBL212730
TypeSmall organic molecule
Emp. Form.C25H40N2O
Mol. Mass.384.5979
SMILESC(COc1ccc2CCN(CC3CCCCC3)CCc2c1)CN1CCCCC1