Reaction Details
TargetCyclin-dependent kinase 6
LigandBDBM50186375
Substrate/Competitorn/a
Meas. Tech.ChEMBL_365585 (CHEMBL870935)
IC50 7.8±n/a nM
Citation Shimamura, TShibata, JKurihara, HMita, TOtsuki, SSagara, THirai, HIwasawa, Y Identification of potent 5-pyrimidinyl-2-aminothiazole CDK4, 6 inhibitors with significant selectivity over CDK1, 2, 5, 7, and 9. Bioorg Med Chem Lett16:3751-4 (2006) 
 
Cyclin-dependent kinase 6
Name:Cyclin-dependent kinase 6
Type:Enzyme Subunit
Mol. Mass.:36937.42
Organism:Homo sapiens (Human)
Description:Q00534
Residue:326
BDBM50186375
NameBDBM50186375
Synonyms:CHEMBL210540 | N-(5-(2-(cyclohexyloxy)-6-methylpyrimidin-4-yl)thiazol-2-yl)-5-((4-methylpiperazin-1-yl)methyl)pyrazin-2-amine
TypeSmall organic molecule
Emp. Form.C24H32N8OS
Mol. Mass.480.629
SMILESCN1CCN(Cc2cnc(Nc3ncc(s3)-c3cc(C)nc(OC4CCCCC4)n3)cn2)CC1