Reaction Details
TargetCyclin-dependent kinase 9
LigandBDBM50186373
Substrate/Competitorn/a
Meas. Tech.ChEMBL_365590 (CHEMBL870945)
IC50 2.5±n/a nM
Citation Shimamura, TShibata, JKurihara, HMita, TOtsuki, SSagara, THirai, HIwasawa, Y Identification of potent 5-pyrimidinyl-2-aminothiazole CDK4, 6 inhibitors with significant selectivity over CDK1, 2, 5, 7, and 9. Bioorg Med Chem Lett16:3751-4 (2006) 
 
Cyclin-dependent kinase 9
Name:Cyclin-dependent kinase 9
Type:Enzyme Subunit
Mol. Mass.:42789.13
Organism:Homo sapiens (Human)
Description:n/a
Residue:372
BDBM50186373
NameBDBM50186373
Synonyms:CHEMBL424696 | N-(5-(2-(cyclohexyloxy)pyrimidin-4-yl)thiazol-2-yl)pyridin-2-amine
TypeSmall organic molecule
Emp. Form.C18H19N5OS
Mol. Mass.353.441
SMILESC1CCC(CC1)Oc1nccc(n1)-c1cnc(Nc2ccccn2)s1