Reaction Details
TargetCyclin-dependent kinase 4
LigandBDBM50186374
Substrate/Competitorn/a
Meas. Tech.ChEMBL_365584 (CHEMBL870933)
IC50 13±n/a nM
Citation Shimamura, TShibata, JKurihara, HMita, TOtsuki, SSagara, THirai, HIwasawa, Y Identification of potent 5-pyrimidinyl-2-aminothiazole CDK4, 6 inhibitors with significant selectivity over CDK1, 2, 5, 7, and 9. Bioorg Med Chem Lett16:3751-4 (2006) 
 
Cyclin-dependent kinase 4
Name:Cyclin-dependent kinase 4
Type:Enzyme Subunit
Mol. Mass.:33731.96
Organism:Homo sapiens (Human)
Description:P11802
Residue:303
BDBM50186374
NameBDBM50186374
Synonyms:CHEMBL212049 | N-(5-(2-(cyclohexyloxy)-5-methylpyrimidin-4-yl)thiazol-2-yl)pyridin-2-amine
TypeSmall organic molecule
Emp. Form.C19H21N5OS
Mol. Mass.367.468
SMILESCc1cnc(OC2CCCCC2)nc1-c1cnc(Nc2ccccn2)s1