Reaction Details
TargetSphingosine 1-phosphate receptor 3
LigandBDBM50186380
Substrate/Competitorn/a
Meas. Tech.ChEMBL_377652 (CHEMBL863681)
EC50>10000±n/a nM
Citation Vachal, PToth, LMHale, JJYan, LMills, SGChrebet, GLKoehane, CAHajdu, RMilligan, JARosenbach, MJMandala, S Highly selective and potent agonists of sphingosine-1-phosphate 1 (S1P1) receptor. Bioorg Med Chem Lett16:3684-7 (2006) 
 
Sphingosine 1-phosphate receptor 3
Name:Sphingosine 1-phosphate receptor 3
Type:G Protein-Coupled Receptor (GPCR)
Mol. Mass.:42278.13
Organism:Homo sapiens (Human)
Description:Q99500
Residue:378
BDBM50186380
NameBDBM50186380
Synonyms:3-(4-(5-(3-cyano-4-isopropoxyphenyl)-4-methyl-4H-1,2,4-triazol-3-yl)-3-methylphenyl)propanoic acid | CHEMBL211199
TypeSmall organic molecule
Emp. Form.C23H24N4O3
Mol. Mass.404.4617
SMILESCC(C)Oc1ccc(cc1C#N)-c1nnc(-c2ccc(CCC(O)=O)cc2C)n1C