Reaction Details
TargetSphingosine 1-phosphate receptor 1
LigandBDBM22223
Substrate/Competitorn/a
Meas. Tech.ChEMBL_377651 (CHEMBL863677)
EC50 0.1±n/a nM
Citation Vachal, PToth, LMHale, JJYan, LMills, SGChrebet, GLKoehane, CAHajdu, RMilligan, JARosenbach, MJMandala, S Highly selective and potent agonists of sphingosine-1-phosphate 1 (S1P1) receptor. Bioorg Med Chem Lett16:3684-7 (2006) 
 
Sphingosine 1-phosphate receptor 1
Name:Sphingosine 1-phosphate receptor 1
Type:Enzyme
Mol. Mass.:42836.02
Organism:Homo sapiens (Human)
Description:P21453
Residue:382
BDBM22223
NameBDBM22223
Synonyms:3-(4-{5-[3-cyano-4-(propan-2-yloxy)phenyl]-1,2,4-oxadiazol-3-yl}-3-methylphenyl)propanoic acid CHEMBL211505
TypeSmall organic molecule
Emp. Form.C22H21N3O4
Mol. Mass.391.4198
SMILESCC(C)Oc1ccc(cc1C#N)-c1nc(no1)-c1ccc(CCC(O)=O)cc1C