Reaction Details
TargetSphingosine 1-phosphate receptor 1
LigandBDBM50186395
Substrate/Competitorn/a
Meas. Tech.ChEMBL_377651 (CHEMBL863677)
EC50 1.1±n/a nM
Citation Vachal, PToth, LMHale, JJYan, LMills, SGChrebet, GLKoehane, CAHajdu, RMilligan, JARosenbach, MJMandala, S Highly selective and potent agonists of sphingosine-1-phosphate 1 (S1P1) receptor. Bioorg Med Chem Lett16:3684-7 (2006) 
 
Sphingosine 1-phosphate receptor 1
Name:Sphingosine 1-phosphate receptor 1
Type:Enzyme
Mol. Mass.:42836.02
Organism:Homo sapiens (Human)
Description:P21453
Residue:382
BDBM50186395
NameBDBM50186395
Synonyms:3-(4-(5-(3-cyano-4-isopropoxyphenyl)-1,3,4-oxadiazol-2-yl)-3-methylphenyl)propanoic acid | CHEMBL211081
TypeSmall organic molecule
Emp. Form.C22H21N3O4
Mol. Mass.391.4198
SMILESCC(C)Oc1ccc(cc1C#N)-c1nnc(o1)-c1ccc(CCC(O)=O)cc1C