Reaction Details
TargetTyrosine-protein kinase ITK/TSK
LigandBDBM50186461
Substrate/Competitorn/a
Meas. Tech.ChEMBL_377329 (CHEMBL864159)
IC50 14±n/a nM
Citation Das, JFurch, JALiu, CMoquin, RVLin, JSpergel, SHMcIntyre, KWShuster, DJO'Day, KDPenhallow, BHung, CYDoweyko, AMKamath, AZhang, HMarathe, PKanner, SBLin, TADodd, JHBarrish, JCWityak, J Discovery and SAR of 2-amino-5-(thioaryl)thiazoles as potent and selective Itk inhibitors. Bioorg Med Chem Lett16:3706-12 (2006) 
 
Tyrosine-protein kinase ITK/TSK
Name:Tyrosine-protein kinase ITK/TSK
Type:Protein
Mol. Mass.:71839.20
Organism:Homo sapiens (Human)
Description:Q08881
Residue:620
BDBM50186461
NameBDBM50186461
Synonyms:CHEMBL209163 | N-(5-(5-(1-acetylpiperazine-4-carbonyl)-4-methoxy-2-methylphenylthio)thiazol-2-yl)-1H-pyrrole-2-carboxamide
TypeSmall organic molecule
Emp. Form.C23H25N5O4S2
Mol. Mass.499.606
SMILESCOc1cc(C)c(Sc2cnc(NC(=O)c3ccc[nH]3)s2)cc1C(=O)N1CCN(CC1)C(C)=O