Reaction Details
TargetTyrosine-protein kinase ITK/TSK
LigandBDBM50186470
Substrate/Competitorn/a
Meas. Tech.ChEMBL_377329 (CHEMBL864159)
IC50 20±n/a nM
Citation Das, JFurch, JALiu, CMoquin, RVLin, JSpergel, SHMcIntyre, KWShuster, DJO'Day, KDPenhallow, BHung, CYDoweyko, AMKamath, AZhang, HMarathe, PKanner, SBLin, TADodd, JHBarrish, JCWityak, J Discovery and SAR of 2-amino-5-(thioaryl)thiazoles as potent and selective Itk inhibitors. Bioorg Med Chem Lett16:3706-12 (2006) 
 
Tyrosine-protein kinase ITK/TSK
Name:Tyrosine-protein kinase ITK/TSK
Type:Protein
Mol. Mass.:71839.20
Organism:Homo sapiens (Human)
Description:Q08881
Residue:620
BDBM50186470
NameBDBM50186470
Synonyms:CHEMBL211291 | N-(5-(5-(1-acetylpiperazine-4-carbonyl)-4-methoxy-2-methylphenylthio)thiazol-2-yl)-4-(methoxymethyl)benzamide
TypeSmall organic molecule
Emp. Form.C27H30N4O5S2
Mol. Mass.554.681
SMILESCOCc1ccc(cc1)C(=O)Nc1ncc(Sc2cc(C(=O)N3CCN(CC3)C(C)=O)c(OC)cc2C)s1