Reaction Details
TargetTyrosine-protein kinase BTK
LigandBDBM50186460
Substrate/Competitorn/a
Meas. Tech.ChEMBL_377340 (CHEMBL865400)
IC50 4100±n/a nM
Citation Das, JFurch, JALiu, CMoquin, RVLin, JSpergel, SHMcIntyre, KWShuster, DJO'Day, KDPenhallow, BHung, CYDoweyko, AMKamath, AZhang, HMarathe, PKanner, SBLin, TADodd, JHBarrish, JCWityak, J Discovery and SAR of 2-amino-5-(thioaryl)thiazoles as potent and selective Itk inhibitors. Bioorg Med Chem Lett16:3706-12 (2006) 
 
Tyrosine-protein kinase BTK
Name:Tyrosine-protein kinase BTK
Type:Enzyme
Mol. Mass.:76289.95
Organism:Homo sapiens (Human)
Description:Q06187
Residue:659
BDBM50186460
NameBDBM50186460
Synonyms:CHEMBL209148 | N-(5-(5-(1-acetylpiperazine-4-carbonyl)-4-methoxy-2-methylphenylthio)thiazol-2-yl)-4-((3,3-dimethylbutan-2-ylamino)methyl)benzamide
TypeSmall organic molecule
Emp. Form.C32H41N5O4S2
Mol. Mass.623.829
SMILESCOc1cc(C)c(Sc2cnc(NC(=O)c3ccc(CNC(C)C(C)(C)C)cc3)s2)cc1C(=O)N1CCN(CC1)C(C)=O