Reaction Details
TargetTyrosine-protein kinase ITK/TSK
LigandBDBM50186471
Substrate/Competitorn/a
Meas. Tech.ChEMBL_377329 (CHEMBL864159)
IC50 970±n/a nM
Citation Das, JFurch, JALiu, CMoquin, RVLin, JSpergel, SHMcIntyre, KWShuster, DJO'Day, KDPenhallow, BHung, CYDoweyko, AMKamath, AZhang, HMarathe, PKanner, SBLin, TADodd, JHBarrish, JCWityak, J Discovery and SAR of 2-amino-5-(thioaryl)thiazoles as potent and selective Itk inhibitors. Bioorg Med Chem Lett16:3706-12 (2006) 
 
Tyrosine-protein kinase ITK/TSK
Name:Tyrosine-protein kinase ITK/TSK
Type:Protein
Mol. Mass.:71839.20
Organism:Homo sapiens (Human)
Description:Q08881
Residue:620
BDBM50186471
NameBDBM50186471
Synonyms:CHEMBL437495 | N-(5-(3-(1-acetylpiperazine-4-carbonyl)phenylthio)thiazol-2-yl)-4-(dimethylamino)benzamide
TypeSmall organic molecule
Emp. Form.C25H27N5O3S2
Mol. Mass.509.644
SMILESCN(C)c1ccc(cc1)C(=O)Nc1ncc(Sc2cccc(c2)C(=O)N2CCN(CC2)C(C)=O)s1