Reaction Details
TargetTyrosine-protein kinase ITK/TSK
LigandBDBM50186477
Substrate/Competitorn/a
Meas. Tech.ChEMBL_377329 (CHEMBL864159)
IC50 47±n/a nM
Citation Das, JFurch, JALiu, CMoquin, RVLin, JSpergel, SHMcIntyre, KWShuster, DJO'Day, KDPenhallow, BHung, CYDoweyko, AMKamath, AZhang, HMarathe, PKanner, SBLin, TADodd, JHBarrish, JCWityak, J Discovery and SAR of 2-amino-5-(thioaryl)thiazoles as potent and selective Itk inhibitors. Bioorg Med Chem Lett16:3706-12 (2006) 
 
Tyrosine-protein kinase ITK/TSK
Name:Tyrosine-protein kinase ITK/TSK
Type:Protein
Mol. Mass.:71839.20
Organism:Homo sapiens (Human)
Description:Q08881
Residue:620
BDBM50186477
NameBDBM50186477
Synonyms:CHEMBL380058 | N-(5-(5-(1-acetylpiperazine-4-carbonyl)-4-methoxy-2-methylphenylthio)thiazol-2-yl)-4-isopropoxybenzamide
TypeSmall organic molecule
Emp. Form.C28H32N4O5S2
Mol. Mass.568.707
SMILESCOc1cc(C)c(Sc2cnc(NC(=O)c3ccc(OC(C)C)cc3)s2)cc1C(=O)N1CCN(CC1)C(C)=O