Reaction Details
TargetTyrosine-protein kinase ITK/TSK
LigandBDBM50186494
Substrate/Competitorn/a
Meas. Tech.ChEMBL_377329 (CHEMBL864159)
IC50 3900±n/a nM
Citation Das, JFurch, JALiu, CMoquin, RVLin, JSpergel, SHMcIntyre, KWShuster, DJO'Day, KDPenhallow, BHung, CYDoweyko, AMKamath, AZhang, HMarathe, PKanner, SBLin, TADodd, JHBarrish, JCWityak, J Discovery and SAR of 2-amino-5-(thioaryl)thiazoles as potent and selective Itk inhibitors. Bioorg Med Chem Lett16:3706-12 (2006) 
 
Tyrosine-protein kinase ITK/TSK
Name:Tyrosine-protein kinase ITK/TSK
Type:Protein
Mol. Mass.:71839.20
Organism:Homo sapiens (Human)
Description:Q08881
Residue:620
BDBM50186494
NameBDBM50186494
Synonyms:CHEMBL209056 | N-(5-(5-(1-acetylpiperazine-4-carbonyl)-2,3-dimethylphenylthio)thiazol-2-yl)-4-(dimethylamino)benzamide
TypeSmall organic molecule
Emp. Form.C27H31N5O3S2
Mol. Mass.537.697
SMILESCN(C)c1ccc(cc1)C(=O)Nc1ncc(Sc2cc(cc(C)c2C)C(=O)N2CCN(CC2)C(C)=O)s1