Reaction Details
TargetTyrosine-protein kinase ITK/TSK
LigandBDBM50186493
Substrate/Competitorn/a
Meas. Tech.ChEMBL_377329 (CHEMBL864159)
IC50 46300±n/a nM
Citation Das, JFurch, JALiu, CMoquin, RVLin, JSpergel, SHMcIntyre, KWShuster, DJO'Day, KDPenhallow, BHung, CYDoweyko, AMKamath, AZhang, HMarathe, PKanner, SBLin, TADodd, JHBarrish, JCWityak, J Discovery and SAR of 2-amino-5-(thioaryl)thiazoles as potent and selective Itk inhibitors. Bioorg Med Chem Lett16:3706-12 (2006) 
 
Tyrosine-protein kinase ITK/TSK
Name:Tyrosine-protein kinase ITK/TSK
Type:Protein
Mol. Mass.:71839.20
Organism:Homo sapiens (Human)
Description:Q08881
Residue:620
BDBM50186493
NameBDBM50186493
Synonyms:1-(4-(3-(2-(pyrimidin-2-ylamino)thiazol-5-ylthio)benzoyl)piperazin-1-yl)ethanone | CHEMBL380042
TypeSmall organic molecule
Emp. Form.C20H20N6O2S2
Mol. Mass.440.542
SMILESCC(=O)N1CCN(CC1)C(=O)c1cccc(Sc2cnc(Nc3ncccn3)s2)c1