Reaction Details
TargetSubstance-P receptor
LigandBDBM50186531
Substrate/Competitorn/a
Meas. Tech.ChEMBL_377172 (CHEMBL869696)
Ki 0.4±n/a nM
Citation Wrobleski, MLReichard, GAPaliwal, SShah, STsui, HCDuffy, RALachowicz, JEMorgan, CAVarty, GBShih, NY Cyclobutane derivatives as potent NK1 selective antagonists. Bioorg Med Chem Lett16:3859-63 (2006) 
 
Substance-P receptor
Name:Substance-P receptor
Type:G Protein-Coupled Receptor (GPCR)
Mol. Mass.:46254.43
Organism:Homo sapiens (Human)
Description:P25103
Residue:407
BDBM50186531
NameBDBM50186531
Synonyms:CHEMBL379073 | cis-N-{3-[(R)-1-(3,5-bis-trifluoromethyl-phenyl)-ethoxymethyl]-3-phenyl-cyclobutyl}-acetamide
TypeSmall organic molecule
Emp. Form.C23H23F6NO2
Mol. Mass.459.4246
SMILESC[C@@H](OC[C@@]1(C[C@@H](C1)NC(C)=O)c1ccccc1)c1cc(cc(c1)C(F)(F)F)C(F)(F)F