Reaction Details
TargetNeuromedin-K receptor
LigandBDBM50186527
Substrate/Competitorn/a
Meas. Tech.ChEMBL_377175 (CHEMBL869705)
Ki 4051±n/a nM
Citation Wrobleski, MLReichard, GAPaliwal, SShah, STsui, HCDuffy, RALachowicz, JEMorgan, CAVarty, GBShih, NY Cyclobutane derivatives as potent NK1 selective antagonists. Bioorg Med Chem Lett16:3859-63 (2006) 
 
Neuromedin-K receptor
Name:Neuromedin-K receptor
Type:Enzyme
Mol. Mass.:52221.96
Organism:Homo sapiens (Human)
Description:P29371
Residue:465
BDBM50186527
NameBDBM50186527
Synonyms:(R)-3-((1-(3,5-bis(trifluoromethyl)phenyl)ethoxy)methyl)-3-phenylcyclobutanamine | CHEMBL212428
TypeSmall organic molecule
Emp. Form.C21H21F6NO
Mol. Mass.417.388
SMILESC[C@@H](OCC1(CC(N)C1)c1ccccc1)c1cc(cc(c1)C(F)(F)F)C(F)(F)F