Reaction Details
TargetCannabinoid receptor 2
LigandBDBM50186533
Substrate/Competitorn/a
Meas. Tech.ChEMBL_377146 (CHEMBL870295)
Ki 220±n/a nM
Citation Balas, LCascio, MGDi Marzo, VDurand, T Synthesis of a potential photoactivatable anandamide analog. Bioorg Med Chem Lett16:3765-8 (2006) 
 
Cannabinoid receptor 2
Name:Cannabinoid receptor 2
Type:G Protein-Coupled Receptor (GPCR)
Mol. Mass.:39690.94
Organism:Homo sapiens (Human)
Description:P34972
Residue:360
BDBM50186533
NameBDBM50186533
Synonyms:(3Z,6Z,9Z,12Z)-17-((R)-1-hydroxypropan-2-ylamino)-17-oxoheptadeca-3,6,9,12-tetraenyl 2-azido-5-iodobenzoate | CHEMBL208548
TypeSmall organic molecule
Emp. Form.C27H35IN4O4
Mol. Mass.606.4957
SMILESC[C@H](CO)NC(=O)CCC\C=C/C\C=C/C\C=C/C\C=C/CCOC(=O)c1cc(I)ccc1N=[N+]=[N-]