Reaction Details
TargetInhibitor of nuclear factor kappa-B kinase subunit beta
LigandBDBM50137196
Substrate/Competitorn/a
Meas. Tech.ChEMBL_353243 (CHEMBL865082)
IC50 970±n/a nM
Citation Morwick, TBerry, ABrickwood, JCardozo, MCatron, KDeTuri, MEmeigh, JHomon, CHrapchak, MJacober, SJakes, SKaplita, PKelly, TAKsiazek, JLiuzzi, MMagolda, RMao, CMarshall, DMcNeil, DProkopowicz, ASarko, CScouten, ESledziona, CSun, SWatrous, JWu, JPCywin, CL Evolution of the thienopyridine class of inhibitors of IkappaB kinase-beta: part I: hit-to-lead strategies. J Med Chem49:2898-908 (2006) 
 
Inhibitor of nuclear factor kappa-B kinase subunit beta
Name:Inhibitor of nuclear factor kappa-B kinase subunit beta
Type:Serine/threonine-protein kinase
Mol. Mass.:86554.39
Organism:Homo sapiens (Human)
Description:GST-tagged IKK-2 was expressed in High Five cells and purified.
Residue:756
BDBM50137196
NameBDBM50137196
Synonyms:6-Phenyl-thieno[3,2-d]pyrimidin-4-ylamine | CHEMBL311108
TypeSmall organic molecule
Emp. Form.C12H9N3S
Mol. Mass.227.285
SMILESNc1ncnc2cc(sc12)-c1ccccc1