Reaction Details
TargetProteasome subunit beta type-5
LigandBDBM50410903
Substrate/Competitorn/a
Meas. Tech.ChEMBL_353294 (CHEMBL861973)
Ki 0.5±n/a nM
Citation Rydzewski, RMBurrill, LMendonca, RPalmer, JTRice, MTahilramani, RBass, KELeung, LGjerstad, EJanc, JWPan, L Optimization of subsite binding to the beta5 subunit of the human 20S proteasome using vinyl sulfones and 2-keto-1,3,4-oxadiazoles: syntheses and cellular properties of potent, selective proteasome inhibitors. J Med Chem49:2953-68 (2006) 
 
Proteasome subunit beta type-5
Name:Proteasome subunit beta type-5
Type:Protein
Mol. Mass.:28480.96
Organism:Homo sapiens (Human)
Description:n/a
Residue:263
BDBM50410903
NameBDBM50410903
Synonyms:CHEMBL207598
TypeSmall organic molecule
Emp. Form.C36H51N7O8S
Mol. Mass.741.897
SMILESCOC[C@H](NC(=O)[C@H](CC(=O)NCC(C)(C)C)NS(=O)(=O)c1ccc(C)cc1)C(=O)N[C@@H](CC(C)C)C(=O)c1nnc(o1)-c1ccc(cc1)N(C)C