Reaction Details
TargetProteasome subunit beta type-2
LigandBDBM50410904
Substrate/Competitorn/a
Meas. Tech.ChEMBL_353295 (CHEMBL861974)
Ki>900000±n/a nM
Citation Rydzewski, RMBurrill, LMendonca, RPalmer, JTRice, MTahilramani, RBass, KELeung, LGjerstad, EJanc, JWPan, L Optimization of subsite binding to the beta5 subunit of the human 20S proteasome using vinyl sulfones and 2-keto-1,3,4-oxadiazoles: syntheses and cellular properties of potent, selective proteasome inhibitors. J Med Chem49:2953-68 (2006) 
 
Proteasome subunit beta type-2
Name:Proteasome subunit beta type-2
Type:PROTEIN
Mol. Mass.:22837.53
Organism:Homo sapiens (Human)
Description:ChEMBL_1294233
Residue:201
BDBM50410904
NameBDBM50410904
Synonyms:CHEMBL377532
TypeSmall organic molecule
Emp. Form.C34H46N6O8S
Mol. Mass.698.829
SMILESCOC[C@H](NC(=O)[C@H](CC(=O)NCC(C)(C)C)NS(=O)(=O)c1ccc(C)cc1)C(=O)N[C@@H](CC(C)C)C(=O)c1nnc(o1)-c1ccccc1