Reaction Details
TargetBeta-glucosidase
LigandBDBM50186735
Substrate/Competitorn/a
Meas. Tech.ChEMBL_353428 (CHEMBL870034)
pH6.8±n/a
Ki>1000000±n/a nM
Commentsextracted
Citation Wang, RWQiu, XLBols, MOrtega-Caballero, FQing, FL Synthesis and biological evaluation of glycosidase inhibitors: gem-difluoromethylenated nojirimycin analogues. J Med Chem49:2989-97 (2006) 
 
Beta-glucosidase
Name:Beta-glucosidase
Synonyms:BGLS_WICAO
Type:PROTEIN
Mol. Mass.:89534.43
Organism:Hansenula anomala
Description:ChEMBL_353428
Residue:825
BDBM50186735
NameBDBM50186735
TypeSmall organic molecule
Emp. Form.C6H11F2NO3
Mol. Mass.183.1532
SMILESOC[C@H]1NC[C@@H](O)[C@@H](O)C1(F)F