Reaction Details
TargetS-ribosylhomocysteine lyase
LigandBDBM50148771
Substrate/Competitorn/a
Meas. Tech.ChEMBL_353579 (CHEMBL861694)
Ki 720000±n/a nM
Citation Shen, GRajan, RZhu, JBell, CEPei, D Design and synthesis of substrate and intermediate analogue inhibitors of S-ribosylhomocysteinase. J Med Chem49:3003-11 (2006) 
 
S-ribosylhomocysteine lyase
Name:S-ribosylhomocysteine lyase
Type:PROTEIN
Mol. Mass.:19410.45
Organism:Escherichia coli (strain K12)
Description:ChEMBL_353579
Residue:171
BDBM50148771
NameBDBM50148771
Synonyms:(2R,3R)-N,2,3,4-TETRAHYDROXYBUTANAMIDE CHEMBL117442 | D-erythronohydroxamic acid
TypeSmall organic molecule
Emp. Form.C4H9NO5
Mol. Mass.151.118
SMILESOC[C@@H](O)[C@@H](O)C(=O)NO