Reaction Details
TargetS-ribosylhomocysteine lyase
LigandBDBM50186742
Substrate/Competitorn/a
Meas. Tech.ChEMBL_353578 (CHEMBL861693)
Ki 68000±n/a nM
Citation Shen, GRajan, RZhu, JBell, CEPei, D Design and synthesis of substrate and intermediate analogue inhibitors of S-ribosylhomocysteinase. J Med Chem49:3003-11 (2006) 
 
S-ribosylhomocysteine lyase
Name:S-ribosylhomocysteine lyase
Type:PROTEIN
Mol. Mass.:17709.00
Organism:Bacillus subtilis
Description:ChEMBL_764478
Residue:157
BDBM50186742
NameBDBM50186742
Synonyms:(2S)-2-amino-6-(N-formyl-N-hydroxylamino)hexanoic acid | CHEMBL206725
TypeSmall organic molecule
Emp. Form.C7H14N2O4
Mol. Mass.190.1971
SMILESN[C@@H](CCCCN(O)C=O)C(O)=O