Reaction Details
TargetS-ribosylhomocysteine lyase
LigandBDBM50186743
Substrate/Competitorn/a
Meas. Tech.ChEMBL_353578 (CHEMBL861693)
Ki 70000±n/a nM
Citation Shen, GRajan, RZhu, JBell, CEPei, D Design and synthesis of substrate and intermediate analogue inhibitors of S-ribosylhomocysteinase. J Med Chem49:3003-11 (2006) 
 
S-ribosylhomocysteine lyase
Name:S-ribosylhomocysteine lyase
Type:PROTEIN
Mol. Mass.:17709.00
Organism:Bacillus subtilis
Description:ChEMBL_764478
Residue:157
BDBM50186743
NameBDBM50186743
Synonyms:CHEMBL383729 | S-ribosylcysteine
TypeSmall organic molecule
Emp. Form.C8H15NO6S
Mol. Mass.253.273
SMILESN[C@H](CSC[C@H]1O[C@@H](O)[C@H](O)[C@@H]1O)C(O)=O