Reaction Details
TargetS-ribosylhomocysteine lyase
LigandBDBM50186747
Substrate/Competitorn/a
Meas. Tech.ChEMBL_353580 (CHEMBL861696)
Ki 9700±n/a nM
Citation Shen, GRajan, RZhu, JBell, CEPei, D Design and synthesis of substrate and intermediate analogue inhibitors of S-ribosylhomocysteinase. J Med Chem49:3003-11 (2006) 
 
S-ribosylhomocysteine lyase
Name:S-ribosylhomocysteine lyase
Type:PROTEIN
Mol. Mass.:19136.16
Organism:Vibrio harveyi (strain ATCC BAA-1116 / BB120)
Description:ChEMBL_353580
Residue:172
BDBM50186747
NameBDBM50186747
Synonyms:(2S)-2-AMINO-4-[(2R,3S)-2,3-DIHYDROXY-3-N-HYDROXYCARBAMOYL-PROPYLMERCAPTO]BUTYRIC ACID CHEMBL207406
TypeSmall organic molecule
Emp. Form.C8H16N2O6S
Mol. Mass.268.287
SMILESN[C@@H](CCSC[C@@H](O)[C@@H](O)C(=O)NO)C(O)=O