Reaction Details
TargetMelanocortin receptor 4
LigandBDBM50186868
Substrate/Competitorn/a
Meas. Tech.ChEMBL_376512 (CHEMBL869042)
Ki 6.8±n/a nM
Citation Kuklish, SLBacker, RTBriner, KDoecke, CWHusain, SMullaney, JTOrnstein, PLZgombick, JMO'Brien, TPFisher, MJ Privileged structure based ligands for melanocortin receptors--4,4-disubstituted piperidine derivatives. Bioorg Med Chem Lett16:3843-6 (2006) 
 
Melanocortin receptor 4
Name:Melanocortin receptor 4
Type:Enzyme
Mol. Mass.:36949.50
Organism:Homo sapiens (Human)
Description:P32245
Residue:332
BDBM50186868
NameBDBM50186868
Synonyms:CHEMBL213340 | N-{(R)-1-(4-chloro-benzyl)-2-[4-(4-cyclohexylmethyl-1-methyl-piperidin-4-yl)-piperazin-1-yl]-2-oxo-ethyl}-2-(2,3-dihydro-1H-isoindol-1-yl)-acetamide trifluoroacetic acid
TypeSmall organic molecule
Emp. Form.C36H50ClN5O2
Mol. Mass.620.267
SMILESCN1CCC(CC2CCCCC2)(CC1)N1CCN(CC1)C(=O)[C@@H](Cc1ccc(Cl)cc1)NC(=O)CC1NCc2ccccc12