Reaction Details
TargetMelanocortin receptor 4
LigandBDBM50166519
Substrate/Competitorn/a
Meas. Tech.ChEMBL_376465 (CHEMBL863666)
Ki 2.4±n/a nM
Citation Tran, JAPontillo, JFleck, BAMarinkovic, DArellano, MTucci, FCLanier, MSaunders, JJiang, WChen, CWFoster, ACChen, C Design, synthesis, and SAR studies on a series of 2-pyridinylpiperazines as potent antagonists of the melanocortin-4 receptor. Bioorg Med Chem Lett16:3693-6 (2006) 
 
Melanocortin receptor 4
Name:Melanocortin receptor 4
Type:Enzyme
Mol. Mass.:36949.50
Organism:Homo sapiens (Human)
Description:P32245
Residue:332
BDBM50166519
NameBDBM50166519
Synonyms:(R)-N-(3-(2,4-dichlorophenyl)-1-oxo-1-(4-(2-((2-(thiophen-2-yl)ethylamino)methyl)phenyl)piperazin-1-yl)propan-2-yl)acetamide N-[(R)-1-(2,4-Dichloro-benzyl)-2-oxo-2-(4-{2-[(2-thiophen-2-yl-ethylamino)-methyl]-phenyl}-piperazin-1-yl)-ethyl]-acetamide
TypeSmall organic molecule
Emp. Form.C28H32Cl2N4O2S
Mol. Mass.559.55
SMILESCC(=O)N[C@H](Cc1ccc(Cl)cc1Cl)C(=O)N1CCN(CC1)c1ccccc1CNCCc1cccs1