Reaction Details
TargetSphingosine 1-phosphate receptor 5
LigandBDBM50186925
Substrate/Competitorn/a
Meas. Tech.ChEMBL_376410 (CHEMBL866638)
EC50>10000±n/a nM
Citation Yan, LHuo, PDoherty, GToth, LHale, JJMills, SGHajdu, RKeohane, CARosenbach, MJMilligan, JAShei, GJChrebet, GBergstrom, JCard, DQuackenbush, EWickham, AMandala, SM Discovery of 3-arylpropionic acids as potent agonists of sphingosine-1-phosphate receptor-1 (S1P1) with high selectivity against all other known S1P receptor subtypes. Bioorg Med Chem Lett16:3679-83 (2006) 
 
Sphingosine 1-phosphate receptor 5
Name:Sphingosine 1-phosphate receptor 5
Type:G Protein-Coupled Receptor (GPCR)
Mol. Mass.:41796.42
Organism:Homo sapiens (Human)
Description:n/a
Residue:398
BDBM50186925
NameBDBM50186925
Synonyms:4-(5-(4-cyclohexylphenyl)-1,2,4-oxadiazol-3-yl)-3-methylbenzoic acid | CHEMBL208682
TypeSmall organic molecule
Emp. Form.C22H22N2O3
Mol. Mass.362.4217
SMILESCc1cc(ccc1-c1noc(n1)-c1ccc(cc1)C1CCCCC1)C(O)=O