Reaction Details
TargetSphingosine 1-phosphate receptor 2
LigandBDBM50186405
Substrate/Competitorn/a
Meas. Tech.ChEMBL_376407 (CHEMBL866633)
EC50>10000±n/a nM
Citation Yan, LHuo, PDoherty, GToth, LHale, JJMills, SGHajdu, RKeohane, CARosenbach, MJMilligan, JAShei, GJChrebet, GBergstrom, JCard, DQuackenbush, EWickham, AMandala, SM Discovery of 3-arylpropionic acids as potent agonists of sphingosine-1-phosphate receptor-1 (S1P1) with high selectivity against all other known S1P receptor subtypes. Bioorg Med Chem Lett16:3679-83 (2006) 
 
Sphingosine 1-phosphate receptor 2
Name:Sphingosine 1-phosphate receptor 2
Type:G Protein-Coupled Receptor (GPCR)
Mol. Mass.:38883.16
Organism:Homo sapiens (Human)
Description:Membranes isolated from S1P2-transfected CHO cells were used in ligand binding assay.
Residue:353
BDBM50186405
NameBDBM50186405
Synonyms:3-(4-(5-(3-chloro-4-isopropoxyphenyl)-1,2,4-oxadiazol-3-yl)-3-methylphenyl)propanoic acid | CHEMBL206940
TypeSmall organic molecule
Emp. Form.C21H21ClN2O4
Mol. Mass.400.855
SMILESCC(C)Oc1ccc(cc1Cl)-c1nc(no1)-c1ccc(CCC(O)=O)cc1C