Reaction Details
TargetSphingosine 1-phosphate receptor 3
LigandBDBM50186934
Substrate/Competitorn/a
Meas. Tech.ChEMBL_376408 (CHEMBL866636)
EC50 1600±n/a nM
Citation Yan, LHuo, PDoherty, GToth, LHale, JJMills, SGHajdu, RKeohane, CARosenbach, MJMilligan, JAShei, GJChrebet, GBergstrom, JCard, DQuackenbush, EWickham, AMandala, SM Discovery of 3-arylpropionic acids as potent agonists of sphingosine-1-phosphate receptor-1 (S1P1) with high selectivity against all other known S1P receptor subtypes. Bioorg Med Chem Lett16:3679-83 (2006) 
 
Sphingosine 1-phosphate receptor 3
Name:Sphingosine 1-phosphate receptor 3
Type:G Protein-Coupled Receptor (GPCR)
Mol. Mass.:42278.13
Organism:Homo sapiens (Human)
Description:Q99500
Residue:378
BDBM50186934
NameBDBM50186934
Synonyms:3-(4-(5-(3-cyano-4-(2,2,2-trifluoroethoxy)phenyl)-1,2,4-oxadiazol-3-yl)-3-methylphenyl)propanoic acid | CHEMBL379380
TypeSmall organic molecule
Emp. Form.C21H16F3N3O4
Mol. Mass.431.3646
SMILESCc1cc(CCC(O)=O)ccc1-c1noc(n1)-c1ccc(OCC(F)(F)F)c(c1)C#N