Reaction Details
TargetN-formyl peptide receptor 2
LigandBDBM50186944
Substrate/Competitorn/a
Meas. Tech.ChEMBL_376306 (CHEMBL867962)
EC50 5130±n/a nM
Citation Bürli, RWXu, HZou, XMuller, KGolden, JFrohn, MAdlam, MPlant, MHWong, MMcElvain, MRegal, KViswanadhan, VNTagari, PHungate, R Potent hFPRL1 (ALXR) agonists as potential anti-inflammatory agents. Bioorg Med Chem Lett16:3713-8 (2006) 
 
N-formyl peptide receptor 2
Name:N-formyl peptide receptor 2
Type:G Protein-Coupled Receptor (GPCR)
Mol. Mass.:38968.35
Organism:Homo sapiens (Human)
Description:P25090
Residue:351
BDBM50186944
NameBDBM50186944
Synonyms:1-(1-(4,5-dihydrothiazol-2-yl)-3-isopropyl-2-methyl-5-oxo-2,5-dihydro-1H-pyrazol-4-yl)-3-(4-(methylthio)phenyl)urea | CHEMBL377163
TypeSmall organic molecule
Emp. Form.C18H23N5O2S2
Mol. Mass.405.538
SMILESCSc1ccc(NC(=O)Nc2c(C(C)C)n(C)n(C3=NCCS3)c2=O)cc1