Reaction Details
TargetN-formyl peptide receptor 2
LigandBDBM50186951
Substrate/Competitorn/a
Meas. Tech.ChEMBL_376306 (CHEMBL867962)
EC50>10000±n/a nM
Citation Bürli, RWXu, HZou, XMuller, KGolden, JFrohn, MAdlam, MPlant, MHWong, MMcElvain, MRegal, KViswanadhan, VNTagari, PHungate, R Potent hFPRL1 (ALXR) agonists as potential anti-inflammatory agents. Bioorg Med Chem Lett16:3713-8 (2006) 
 
N-formyl peptide receptor 2
Name:N-formyl peptide receptor 2
Type:G Protein-Coupled Receptor (GPCR)
Mol. Mass.:38968.35
Organism:Homo sapiens (Human)
Description:P25090
Residue:351
BDBM50186951
NameBDBM50186951
Synonyms:1-(3-chlorophenyl)-3-(2,3-dimethyl-5-oxo-1-phenyl-2,5-dihydro-1H-pyrazol-4-yl)urea | CHEMBL209521
TypeSmall organic molecule
Emp. Form.C18H17ClN4O2
Mol. Mass.356.806
SMILESCc1c(NC(=O)Nc2cccc(Cl)c2)c(=O)n(-c2ccccc2)n1C