Reaction Details
TargetN-formyl peptide receptor 2
LigandBDBM50186957
Substrate/Competitorn/a
Meas. Tech.ChEMBL_376306 (CHEMBL867962)
EC50 23±n/a nM
Citation Bürli, RWXu, HZou, XMuller, KGolden, JFrohn, MAdlam, MPlant, MHWong, MMcElvain, MRegal, KViswanadhan, VNTagari, PHungate, R Potent hFPRL1 (ALXR) agonists as potential anti-inflammatory agents. Bioorg Med Chem Lett16:3713-8 (2006) 
 
N-formyl peptide receptor 2
Name:N-formyl peptide receptor 2
Type:G Protein-Coupled Receptor (GPCR)
Mol. Mass.:38968.35
Organism:Homo sapiens (Human)
Description:P25090
Residue:351
BDBM50186957
NameBDBM50186957
Synonyms:1-(3-tert-butyl-2-methyl-5-oxo-1-phenyl-2,5-dihydro-1H-pyrazol-4-yl)-3-(4-chlorophenyl)urea | CHEMBL377226
TypeSmall organic molecule
Emp. Form.C21H23ClN4O2
Mol. Mass.398.886
SMILESCn1c(c(NC(=O)Nc2ccc(Cl)cc2)c(=O)n1-c1ccccc1)C(C)(C)C