Reaction Details
TargetN-formyl peptide receptor 2
LigandBDBM50186965
Substrate/Competitorn/a
Meas. Tech.ChEMBL_376306 (CHEMBL867962)
EC50 5880±n/a nM
Citation Bürli, RWXu, HZou, XMuller, KGolden, JFrohn, MAdlam, MPlant, MHWong, MMcElvain, MRegal, KViswanadhan, VNTagari, PHungate, R Potent hFPRL1 (ALXR) agonists as potential anti-inflammatory agents. Bioorg Med Chem Lett16:3713-8 (2006) 
 
N-formyl peptide receptor 2
Name:N-formyl peptide receptor 2
Type:G Protein-Coupled Receptor (GPCR)
Mol. Mass.:38968.35
Organism:Homo sapiens (Human)
Description:P25090
Residue:351
BDBM50186965
NameBDBM50186965
Synonyms:1-(benzo[d][1,3]dioxol-5-yl)-3-(2,3-dimethyl-5-oxo-1-phenyl-2,5-dihydro-1H-pyrazol-4-yl)urea | CHEMBL209102
TypeSmall organic molecule
Emp. Form.C19H18N4O4
Mol. Mass.366.3706
SMILESCc1c(NC(=O)Nc2ccc3OCOc3c2)c(=O)n(-c2ccccc2)n1C