Reaction Details
TargetAdenosine receptor A2b
LigandBDBM50186983
Substrate/Competitorn/a
Meas. Tech.ChEMBL_376053 (CHEMBL864807)
IC50 13±n/a nM
Citation Esteve, CNueda, ADíaz, JLBeleta, JCárdenas, ALozoya, ECadavid, MILoza, MIRyder, HVidal, B New pyrrolopyrimidin-6-yl benzenesulfonamides: potent A2B adenosine receptor antagonists. Bioorg Med Chem Lett16:3642-5 (2006) 
 
Adenosine receptor A2b
Name:Adenosine receptor A2b
Type:G Protein-Coupled Receptor (GPCR)
Mol. Mass.:36341.22
Organism:Homo sapiens (Human)
Description:n/a
Residue:332
BDBM50186983
NameBDBM50186983
Synonyms:6-(4-(4-(benzo[d][1,3]dioxol-5-ylmethyl)piperazin-1-ylsulfonyl)phenyl)-3-methyl-1-propyl-1H-pyrrolo[3,2-d]pyrimidine-2,4(3H,5H)-dione | CHEMBL211071
TypeSmall organic molecule
Emp. Form.C28H31N5O6S
Mol. Mass.565.641
SMILESCCCn1c2cc([nH]c2c(=O)n(C)c1=O)-c1ccc(cc1)S(=O)(=O)N1CCN(Cc2ccc3OCOc3c2)CC1