Reaction Details
TargetAdenosine receptor A2b
LigandBDBM50186980
Substrate/Competitorn/a
Meas. Tech.ChEMBL_376053 (CHEMBL864807)
IC50 1±n/a nM
Citation Esteve, CNueda, ADíaz, JLBeleta, JCárdenas, ALozoya, ECadavid, MILoza, MIRyder, HVidal, B New pyrrolopyrimidin-6-yl benzenesulfonamides: potent A2B adenosine receptor antagonists. Bioorg Med Chem Lett16:3642-5 (2006) 
 
Adenosine receptor A2b
Name:Adenosine receptor A2b
Type:G Protein-Coupled Receptor (GPCR)
Mol. Mass.:36341.22
Organism:Homo sapiens (Human)
Description:n/a
Residue:332
BDBM50186980
NameBDBM50186980
Synonyms:6-(4-{[4-(4-bromobenzyl)piperazin-1-yl]sulfonyl}phenyl)-1,3-dimethyl-1H-pyrrolo[3,2-d]pyrimidine-2,4(3H,5H)-dione | CHEMBL437309
TypeSmall organic molecule
Emp. Form.C25H26BrN5O4S
Mol. Mass.572.474
SMILESCn1c2cc([nH]c2c(=O)n(C)c1=O)-c1ccc(cc1)S(=O)(=O)N1CCN(Cc2ccc(Br)cc2)CC1