Reaction Details
TargetC-X-C chemokine receptor type 2
LigandBDBM50186998
Substrate/Competitorn/a
Meas. Tech.ChEMBL_384848 (CHEMBL867334)
IC50 56±n/a nM
Citation Merritt, JRRokosz, LLNelson, KHKaiser, BWang, WStauffer, TMOzgur, LESchilling, ALi, GBaldwin, JJTaveras, AGDwyer, MPChao, J Synthesis and structure-activity relationships of 3,4-diaminocyclobut-3-ene-1,2-dione CXCR2 antagonists. Bioorg Med Chem Lett16:4107-10 (2006) 
 
C-X-C chemokine receptor type 2
Name:C-X-C chemokine receptor type 2
Type:Protein
Mol. Mass.:40767.88
Organism:Homo sapiens (Human)
Description:P25025
Residue:360
BDBM50186998
NameBDBM50186998
Synonyms:3-(2-hydroxy-5-nitrophenylamino)-4-(phenylamino)cyclobut-3-ene-1,2-dione | CHEMBL209858
TypeSmall organic molecule
Emp. Form.C16H11N3O5
Mol. Mass.325.2756
SMILESOc1ccc(cc1Nc1c(Nc2ccccc2)c(=O)c1=O)[N+]([O-])=O