Reaction Details
TargetRNA-directed RNA polymerase
LigandBDBM50187224
Substrate/Competitorn/a
Meas. Tech.ChEMBL_356302 (CHEMBL869357)
IC50 1700±n/a nM
Citation Gopalsamy, AChopra, RLim, KCiszewski, GShi, MCurran, KJSukits, SFSvenson, KBard, JEllingboe, JWAgarwal, AKrishnamurthy, GHowe, AYOrlowski, MFeld, BO'Connell, JMansour, TS Discovery of proline sulfonamides as potent and selective hepatitis C virus NS5b polymerase inhibitors. Evidence for a new NS5b polymerase binding site. J Med Chem49:3052-5 (2006) 
 
RNA-directed RNA polymerase
Name:RNA-directed RNA polymerase
Type:Protein
Mol. Mass.:25173.95
Organism:Hepatitis C virus
Description:Q8JXU8
Residue:229
BDBM50187224
NameBDBM50187224
Synonyms:(4R)-3-[(3,5-dichloro-2-hydroxyphenyl)sulfonyl]-1,3-thiazolidine-4-carboxylic acid | CHEMBL382995
TypeSmall organic molecule
Emp. Form.C10H9Cl2NO5S2
Mol. Mass.358.218
SMILESOC(=O)[C@H]1CSCN1S(=O)(=O)c1cc(Cl)cc(Cl)c1O