Reaction Details
TargetDipeptidyl peptidase 4
LigandBDBM50187266
Substrate/Competitorn/a
Meas. Tech.ChEMBL_357329 (CHEMBL867558)
IC50 104±n/a nM
Citation Wright, SWAmmirati, MJAndrews, KMBrodeur, AMDanley, DEDoran, SDLillquist, JSMcClure, LDMcPherson, RKOrena, SJParker, JCPolivkova, JQiu, XSoeller, WCSoglia, CBTreadway, JLVanVolkenburg, MAWang, HWilder, DCOlson, TV cis-2,5-dicyanopyrrolidine inhibitors of dipeptidyl peptidase IV: synthesis and in vitro, in vivo, and X-ray crystallographic characterization. J Med Chem49:3068-76 (2006) 
 
Dipeptidyl peptidase 4
Name:Dipeptidyl peptidase 4
Type:Enzyme
Mol. Mass.:88271.01
Organism:Homo sapiens (Human)
Description:P27487
Residue:766
BDBM50187266
NameBDBM50187266
Synonyms:(2R,5S)-1-(2-(1-(hydroxymethyl)cyclopentylamino)acetyl)pyrrolidine-2,5-dicarbonitrile | CHEMBL379522
TypeSmall organic molecule
Emp. Form.C14H20N4O2
Mol. Mass.276.3342
SMILESOCC1(CCCC1)NCC(=O)N1[C@@H](CC[C@@H]1C#N)C#N