Reaction Details
TargetDipeptidyl peptidase 4
LigandBDBM50187258
Substrate/Competitorn/a
Meas. Tech.ChEMBL_357329 (CHEMBL867558)
IC50 72±n/a nM
Citation Wright, SWAmmirati, MJAndrews, KMBrodeur, AMDanley, DEDoran, SDLillquist, JSMcClure, LDMcPherson, RKOrena, SJParker, JCPolivkova, JQiu, XSoeller, WCSoglia, CBTreadway, JLVanVolkenburg, MAWang, HWilder, DCOlson, TV cis-2,5-dicyanopyrrolidine inhibitors of dipeptidyl peptidase IV: synthesis and in vitro, in vivo, and X-ray crystallographic characterization. J Med Chem49:3068-76 (2006) 
 
Dipeptidyl peptidase 4
Name:Dipeptidyl peptidase 4
Type:Enzyme
Mol. Mass.:88271.01
Organism:Homo sapiens (Human)
Description:P27487
Residue:766
BDBM50187258
NameBDBM50187258
Synonyms:(2S,5R)-1-[2-(hexahydro-2,5-methano-pentalen-3a-ylamino)-acetyl]-pyrrolidine-2,5-dicarbonitrile | CHEMBL383488
TypeSmall organic molecule
Emp. Form.C17H22N4O
Mol. Mass.298.3828
SMILESO=C(CNC12CC3CC1CC(C2)C3)N1[C@@H](CC[C@@H]1C#N)C#N