Reaction Details
TargetPlatelet-derived growth factor receptor beta
LigandBDBM50187340
Substrate/Competitorn/a
Meas. Tech.ChEMBL_357671 (CHEMBL854267)
IC50 55±n/a nM
Citation Mahboobi, SUecker, ASellmer, ACénac, CHöcher, HPongratz, HEichhorn, EHufsky, HTrümpler, ASicker, MHeidel, FFischer, TStocking, CElz, SBöhmer, FDDove, S Novel bis(1H-indol-2-yl)methanones as potent inhibitors of FLT3 and platelet-derived growth factor receptor tyrosine kinase. J Med Chem49:3101-15 (2006) 
 
Platelet-derived growth factor receptor beta
Name:Platelet-derived growth factor receptor beta
Type:Enzyme
Mol. Mass.:123922.25
Organism:Homo sapiens (Human)
Description:P09619
Residue:1106
BDBM50187340
NameBDBM50187340
Synonyms:(6-Chloro-1H-indol-2-yl)-(5-methoxy-1H-indol-2-yl)-methanone | CHEMBL206915
TypeSmall organic molecule
Emp. Form.C18H13ClN2O2
Mol. Mass.324.761
SMILESCOc1ccc2[nH]c(cc2c1)C(=O)c1cc2ccc(Cl)cc2[nH]1