Reaction Details
TargetReceptor-type tyrosine-protein kinase FLT3
LigandBDBM50187361
Substrate/Competitorn/a
Meas. Tech.ChEMBL_357668 (CHEMBL854264)
IC50 920±n/a nM
Citation Mahboobi, SUecker, ASellmer, ACénac, CHöcher, HPongratz, HEichhorn, EHufsky, HTrümpler, ASicker, MHeidel, FFischer, TStocking, CElz, SBöhmer, FDDove, S Novel bis(1H-indol-2-yl)methanones as potent inhibitors of FLT3 and platelet-derived growth factor receptor tyrosine kinase. J Med Chem49:3101-15 (2006) 
 
Receptor-type tyrosine-protein kinase FLT3
Name:Receptor-type tyrosine-protein kinase FLT3
Type:Enzyme
Mol. Mass.:112888.62
Organism:Homo sapiens (Human)
Description:P36888
Residue:993
BDBM50187361
NameBDBM50187361
Synonyms:(4-Chloro-1H-indol-2-yl)-(5-hydroxy-1H-indol-2-yl)-methanone | CHEMBL377652
TypeSmall organic molecule
Emp. Form.C17H11ClN2O2
Mol. Mass.310.734
SMILESOc1ccc2[nH]c(cc2c1)C(=O)c1cc2c(Cl)cccc2[nH]1