Reaction Details
TargetReceptor-type tyrosine-protein kinase FLT3
LigandBDBM50187343
Substrate/Competitorn/a
Meas. Tech.ChEMBL_357668 (CHEMBL854264)
IC50 3400±n/a nM
Citation Mahboobi, SUecker, ASellmer, ACénac, CHöcher, HPongratz, HEichhorn, EHufsky, HTrümpler, ASicker, MHeidel, FFischer, TStocking, CElz, SBöhmer, FDDove, S Novel bis(1H-indol-2-yl)methanones as potent inhibitors of FLT3 and platelet-derived growth factor receptor tyrosine kinase. J Med Chem49:3101-15 (2006) 
 
Receptor-type tyrosine-protein kinase FLT3
Name:Receptor-type tyrosine-protein kinase FLT3
Type:Enzyme
Mol. Mass.:112888.62
Organism:Homo sapiens (Human)
Description:P36888
Residue:993
BDBM50187343
NameBDBM50187343
Synonyms:(4-Bromo-1H-indol-2-yl)-(5-hydroxy-1H-indol-2-yl)-methanone | CHEMBL210726
TypeSmall organic molecule
Emp. Form.C17H11BrN2O2
Mol. Mass.355.185
SMILESOc1ccc2[nH]c(cc2c1)C(=O)c1cc2c(Br)cccc2[nH]1