Reaction Details
TargetReceptor-type tyrosine-protein kinase FLT3
LigandBDBM33408
Substrate/Competitorn/a
Meas. Tech.ChEMBL_357668 (CHEMBL854264)
IC50 1100±n/a nM
Citation Mahboobi, SUecker, ASellmer, ACénac, CHöcher, HPongratz, HEichhorn, EHufsky, HTrümpler, ASicker, MHeidel, FFischer, TStocking, CElz, SBöhmer, FDDove, S Novel bis(1H-indol-2-yl)methanones as potent inhibitors of FLT3 and platelet-derived growth factor receptor tyrosine kinase. J Med Chem49:3101-15 (2006) 
 
Receptor-type tyrosine-protein kinase FLT3
Name:Receptor-type tyrosine-protein kinase FLT3
Type:Enzyme
Mol. Mass.:112888.62
Organism:Homo sapiens (Human)
Description:P36888
Residue:993
BDBM33408
NameBDBM33408
Synonyms:AG1295 cid_2048
TypeSmall organic molecule
Emp. Form.C16H14N2
Mol. Mass.234.2958
SMILESCc1cc2ncc(nc2cc1C)-c1ccccc1