Reaction Details
Target5-hydroxytryptamine receptor 1A
LigandBDBM50187379
Substrate/Competitorn/a
Meas. Tech.ChEMBL_357738 (CHEMBL870197)
Ki 9.2±n/a nM
Citation Becker, OMDhanoa, DSMarantz, YChen, DShacham, SCheruku, SHeifetz, AMohanty, PFichman, MSharadendu, ANudelman, RKauffman, MNoiman, S An integrated in silico 3D model-driven discovery of a novel, potent, and selective amidosulfonamide 5-HT1A agonist (PRX-00023) for the treatment of anxiety and depression. J Med Chem49:3116-35 (2006) 
 
5-hydroxytryptamine receptor 1A
Name:5-hydroxytryptamine receptor 1A
Type:n/a
Mol. Mass.:46122.49
Organism:Homo sapiens (Human)
Description:n/a
Residue:422
BDBM50187379
NameBDBM50187379
Synonyms:CHEMBL379984 | N-(3-{4-[4-(2-methyl-propane-1-sulfonylamino)-butyl]-piperazin-1-yl}-phenyl)-acetamide
TypeSmall organic molecule
Emp. Form.C20H34N4O3S
Mol. Mass.410.574
SMILESCC(C)CS(=O)(=O)NCCCCN1CCN(CC1)c1cccc(NC(C)=O)c1