Reaction Details
TargetProtein kinase C delta type
LigandBDBM50187521
Substrate/Competitorn/a
Meas. Tech.ChEMBL_359267 (CHEMBL871203)
Ki 1.4±n/a nM
Citation Kang, JHBenzaria, SSigano, DMLewin, NEPu, YPeach, MLBlumberg, PMMarquez, VE Conformationally constrained analogues of diacylglycerol. 26. Exploring the chemical space surrounding the C1 domain of protein kinase C with DAG-lactones containing aryl groups at the sn-1 and sn-2 positions. J Med Chem49:3185-203 (2006) 
 
Protein kinase C delta type
Name:Protein kinase C delta type
Type:Enzyme
Mol. Mass.:77516.79
Organism:Homo sapiens (Human)
Description:The recombinant human PKC enzymes were produced using a baculovirus expression system in SF9 cells
Residue:676
BDBM50187521
NameBDBM50187521
Synonyms:(E)-{2-(hydroxymethyl)-4-[(4-hydroxyphenyl)methylene]-5-oxo-2,3-dihydrofur-2-yl}methyl 4-methyl-3-(methylethyl)pentanoate | CHEMBL380645
TypeSmall organic molecule
Emp. Form.C22H30O6
Mol. Mass.390.47
SMILESCC(C)C(CC(=O)OCC1(CO)C\C(=C/c2ccc(O)cc2)C(=O)O1)C(C)C