Reaction Details
TargetIntegrase
LigandBDBM50187771
Substrate/Competitorn/a
Meas. Tech.ChEMBL_378127 (CHEMBL869776)
IC50 7.2±n/a nM
Citation Metobo, SEJin, HTsiang, MKim, CU Design, synthesis, and biological evaluation of novel tricyclic HIV-1 integrase inhibitors by modification of its pyridine ring. Bioorg Med Chem Lett16:3985-8 (2006) 
 
Integrase
Name:Integrase
Synonyms:Human immunodeficiency virus type 1 integrase
Type:PROTEIN
Mol. Mass.:32231.48
Organism:Human immunodeficiency virus 1
Description:ChEMBL_90865
Residue:288
BDBM50187771
NameBDBM50187771
TypeSmall organic molecule
Emp. Form.C19H14F2N2O3
Mol. Mass.356.3229
SMILESCOc1c2CN(Cc3ccc(F)cc3)C(=O)c2c(O)c2ncc(F)cc12